Reaction Details
TargetAurora kinase A
LigandBDBM50348645
Substrate/Competitorn/a
Meas. Tech.ChEMBL_755594 (CHEMBL1805334)
IC50 14±n/a nM
Citation Belanger, DBCurran, PJHruza, AVoigt, JMeng, ZMandal, AKSiddiqui, MABasso, ADGray, K Discovery of imidazo[1,2-a]pyrazine-based Aurora kinase inhibitors. Bioorg Med Chem Lett20:5170-4 (2010) 
 
Aurora kinase A
Name:Aurora kinase A
Type:Serine/threonine-protein kinase
Mol. Mass.:45830.98
Organism:Homo sapiens (Human)
Description:O14965
Residue:403
BDBM50348645
NameBDBM50348645
Synonyms:CHEMBL1801135
TypeSmall organic molecule
Emp. Form.C18H18N8OS
Mol. Mass.394.454
SMILESCc1cc(Nc2nc(cn3c(cnc23)-c2cn[nH]c2)C(=O)N2CCCC2)sn1