Reaction Details
TargetMatrix metalloproteinase-14
LigandBDBM50348667
Substrate/Competitorn/a
Meas. Tech.ChEMBL_754465 (CHEMBL1806090)
IC50 3.1±n/a nM
Citation Becker, DPBarta, TEBedell, LJBoehm, TLBond, BRCarroll, JCarron, CPDecrescenzo, GAEaston, AMFreskos, JNFunckes-Shippy, CLHeron, MHockerman, SHoward, CPKiefer, JRLi, MHMathis, KJMcDonald, JJMehta, PPMunie, GESunyer, TSwearingen, CAVillamil, CIWelsch, DWilliams, JMYu, YYao, J Orally active MMP-1 sparinga-tetrahydropyranyl anda-piperidinyl sulfone matrix metalloproteinase (MMP) inhibitors with efficacy in cancer, arthritis, and cardiovascular disease. J Med Chem53:6653-80 (2010) 
 
Matrix metalloproteinase-14
Name:Matrix metalloproteinase-14
Type:Protein
Mol. Mass.:65900.19
Organism:Homo sapiens (Human)
Description:P50281
Residue:582
BDBM50348667
NameBDBM50348667
Synonyms:CHEMBL1801057
TypeSmall organic molecule
Emp. Form.C25H27N3O6S
Mol. Mass.497.563
SMILESCOc1ccc(Oc2ccc(cc2)S(=O)(=O)C2(CCN(Cc3ccccn3)CC2)C(=O)NO)cc1