Reaction Details
Target72 kDa type IV collagenase
LigandBDBM50348650
Substrate/Competitorn/a
Meas. Tech.ChEMBL_754459 (CHEMBL1806084)
IC50 0.200000±n/a nM
Citation Becker, DPBarta, TEBedell, LJBoehm, TLBond, BRCarroll, JCarron, CPDecrescenzo, GAEaston, AMFreskos, JNFunckes-Shippy, CLHeron, MHockerman, SHoward, CPKiefer, JRLi, MHMathis, KJMcDonald, JJMehta, PPMunie, GESunyer, TSwearingen, CAVillamil, CIWelsch, DWilliams, JMYu, YYao, J Orally active MMP-1 sparinga-tetrahydropyranyl anda-piperidinyl sulfone matrix metalloproteinase (MMP) inhibitors with efficacy in cancer, arthritis, and cardiovascular disease. J Med Chem53:6653-80 (2010) 
 
72 kDa type IV collagenase
Name:72 kDa type IV collagenase
Type:Enzyme
Mol. Mass.:73870.36
Organism:Homo sapiens (Human)
Description: P08253
Residue:660
BDBM50348650
NameBDBM50348650
Synonyms:CHEMBL1801431
TypeSmall organic molecule
Emp. Form.C25H24F3N3O6S
Mol. Mass.551.535
SMILESONC(=O)C1(CCN(Cc2ccccn2)CC1)S(=O)(=O)c1ccc(Oc2ccc(OC(F)(F)F)cc2)cc1