Reaction Details
Target72 kDa type IV collagenase
LigandBDBM50348671
Substrate/Competitorn/a
Meas. Tech.ChEMBL_754459 (CHEMBL1806084)
IC50 0.100000±n/a nM
Citation Becker, DPBarta, TEBedell, LJBoehm, TLBond, BRCarroll, JCarron, CPDecrescenzo, GAEaston, AMFreskos, JNFunckes-Shippy, CLHeron, MHockerman, SHoward, CPKiefer, JRLi, MHMathis, KJMcDonald, JJMehta, PPMunie, GESunyer, TSwearingen, CAVillamil, CIWelsch, DWilliams, JMYu, YYao, J Orally active MMP-1 sparinga-tetrahydropyranyl anda-piperidinyl sulfone matrix metalloproteinase (MMP) inhibitors with efficacy in cancer, arthritis, and cardiovascular disease. J Med Chem53:6653-80 (2010) 
 
72 kDa type IV collagenase
Name:72 kDa type IV collagenase
Type:Enzyme
Mol. Mass.:73870.36
Organism:Homo sapiens (Human)
Description: P08253
Residue:660
BDBM50348671
NameBDBM50348671
Synonyms:CHEMBL1229868
TypeSmall organic molecule
Emp. Form.C19H18F3NO6S
Mol. Mass.445.41
SMILESONC(=O)C1(CCOCC1)S(=O)(=O)c1ccc(Oc2ccc(cc2)C(F)(F)F)cc1