Reaction Details
TargetCytochrome P450 2C19
LigandBDBM50348732
Substrate/Competitorn/a
Meas. Tech.ChEMBL_755033 (CHEMBL1805935)
EC50>38000±n/a nM
Citation Payne, JEBonnefous, CSymons, KTNguyen, PMSablad, MRozenkrants, NZhang, YWang, LYazdani, NShiau, AKNoble, SARix, PRao, TSHassig, CASmith, ND Discovery of dual inducible/neuronal nitric oxide synthase (iNOS/nNOS) inhibitor development candidate 4-((2-cyclobutyl-1H-imidazo[4,5-b]pyrazin-1-yl)methyl)-7,8-difluoroquinolin-2(1H)-one (KD7332) part 2: identification of a novel, potent, and selective series of benzimidazole-quinolinone iNOS/nNO J Med Chem53:7739-55 (2010) 
 
Cytochrome P450 2C19
Name:Cytochrome P450 2C19
Type:Enzyme
Mol. Mass.:55935.47
Organism:Homo sapiens (Human)
Description:P33261
Residue:490
BDBM50348732
NameBDBM50348732
Synonyms:CHEMBL1801504
TypeSmall organic molecule
Emp. Form.C19H15F2N5O
Mol. Mass.367.3521
SMILESFc1ccc2c(Cn3c(nc4nccnc34)C3CCC3)cc(=O)[nH]c2c1F