Reaction Details
TargetPotassium voltage-gated channel subfamily H member 2
LigandBDBM50348732
Substrate/Competitorn/a
Meas. Tech.ChEMBL_755036 (CHEMBL1805938)
EC50>30000±n/a nM
Citation Payne, JEBonnefous, CSymons, KTNguyen, PMSablad, MRozenkrants, NZhang, YWang, LYazdani, NShiau, AKNoble, SARix, PRao, TSHassig, CASmith, ND Discovery of dual inducible/neuronal nitric oxide synthase (iNOS/nNOS) inhibitor development candidate 4-((2-cyclobutyl-1H-imidazo[4,5-b]pyrazin-1-yl)methyl)-7,8-difluoroquinolin-2(1H)-one (KD7332) part 2: identification of a novel, potent, and selective series of benzimidazole-quinolinone iNOS/nNO J Med Chem53:7739-55 (2010) 
 
Potassium voltage-gated channel subfamily H member 2
Name:Potassium voltage-gated channel subfamily H member 2
Type:Multi-pass membrane protein
Mol. Mass.:126672.65
Organism:Homo sapiens (Human)
Description:Q12809
Residue:1159
BDBM50348732
NameBDBM50348732
Synonyms:CHEMBL1801504
TypeSmall organic molecule
Emp. Form.C19H15F2N5O
Mol. Mass.367.3521
SMILESFc1ccc2c(Cn3c(nc4nccnc34)C3CCC3)cc(=O)[nH]c2c1F