Reaction Details
TargetCorticotropin-releasing factor receptor 1
LigandBDBM50348782
Substrate/Competitorn/a
Meas. Tech.ChEMBL_759196 (CHEMBL1811342)
Ki 1±n/a nM
Citation Hodgetts, KJGe, PYoon, TDe Lombaert, SBrodbeck, RGulianello, MKieltyka, AHorvath, RFKehne, JHKrause, JEMaynard, GDHoffman, DLee, YFung, LDoller, D Discovery of N-(1-ethylpropyl)-[3-methoxy-5-(2-methoxy-4-trifluoromethoxyphenyl)-6-methyl-pyrazin-2-yl]amine 59 (NGD 98-2): an orally active corticotropin releasing factor-1 (CRF-1) receptor antagonist. J Med Chem54:4187-206 (2011) 
 
Corticotropin-releasing factor receptor 1
Name:Corticotropin-releasing factor receptor 1
Type:Enzyme
Mol. Mass.:50744.31
Organism:Homo sapiens (Human)
Description:P34998
Residue:444
BDBM50348782
NameBDBM50348782
Synonyms:CHEMBL1807053
TypeSmall organic molecule
Emp. Form.C19H24F3N3O3
Mol. Mass.399.4074
SMILESCCC(CC)Nc1nc(C)c(nc1OC)-c1ccc(OC(F)(F)F)cc1OC