Reaction Details
TargetCorticotropin-releasing factor receptor 1
LigandBDBM50132951
Substrate/Competitorn/a
Meas. Tech.ChEMBL_759193 (CHEMBL1811339)
Ki 0.9±n/a nM
Citation Hodgetts, KJGe, PYoon, TDe Lombaert, SBrodbeck, RGulianello, MKieltyka, AHorvath, RFKehne, JHKrause, JEMaynard, GDHoffman, DLee, YFung, LDoller, D Discovery of N-(1-ethylpropyl)-[3-methoxy-5-(2-methoxy-4-trifluoromethoxyphenyl)-6-methyl-pyrazin-2-yl]amine 59 (NGD 98-2): an orally active corticotropin releasing factor-1 (CRF-1) receptor antagonist. J Med Chem54:4187-206 (2011) 
 
Corticotropin-releasing factor receptor 1
Name:Corticotropin-releasing factor receptor 1
Type:Enzyme
Mol. Mass.:50744.31
Organism:Homo sapiens (Human)
Description:P34998
Residue:444
BDBM50132951
NameBDBM50132951
Synonyms:8-(2,4-dichlorophenyl)-2-methyl-N,N-dipropylquinolin-4-amine [8-(2,4-Dichloro-phenyl)-2-methyl-quinolin-4-yl]-dipropyl-amine
TypeSmall organic molecule
Emp. Form.C22H24Cl2N2
Mol. Mass.387.345
SMILESCCCN(CCC)c1cc(C)nc2c(cccc12)-c1ccc(Cl)cc1Cl