Reaction Details
TargetDelta-type opioid receptor
LigandBDBM50348869
Substrate/Competitorn/a
Meas. Tech.ChEMBL_757806 (CHEMBL1809750)
Ki>4900±n/a nM
Citation Li, FFolk, JECheng, KKurimura, MDeck, JADeschamps, JRRothman, RBDersch, CMJacobson, AERice, KC Probes for narcotic receptor mediated phenomena. 43. Synthesis of the ortho-a and para-a, and improved synthesis and optical resolution of the ortho-b and para-b oxide-bridged phenylmorphans: compounds with moderate to low opioid-receptor affinity. Bioorg Med Chem19:4330-7 (2011) 
 
Delta-type opioid receptor
Name:Delta-type opioid receptor
Type:G Protein-Coupled Receptor (GPCR)
Mol. Mass.:40382.98
Organism:Homo sapiens (Human)
Description:Competition binding assays were carried out using membrane preparations from transfected HN9.10 cells that constitutively expressed the delta opioid receptor.
Residue:372
BDBM50348869
NameBDBM50348869
Synonyms:CHEMBL1808300
TypeSmall organic molecule
Emp. Form.C22H25NO2
Mol. Mass.335.4394
SMILESOc1cccc2c1O[C@@H]1CC[C@@H]3C[C@]21CCN3CCc1ccccc1