Reaction Details
TargetVascular endothelial growth factor receptor 1
LigandBDBM50349005
Substrate/Competitorn/a
Meas. Tech.ChEMBL_758710 (CHEMBL1810162)
IC50>1000±n/a nM
Citation Lin, WHHsieh, SYYen, SCChen, CTYeh, TKHsu, TLu, CTChen, CPChen, CWChou, LHHuang, YLCheng, AHChang, YITseng, YJYen, KRChao, YSHsu, JTJiaang, WT Discovery and evaluation of 3-phenyl-1H-5-pyrazolylamine-based derivatives as potent, selective and efficacious inhibitors of FMS-like tyrosine kinase-3 (FLT3). Bioorg Med Chem19:4173-82 (2011) 
 
Vascular endothelial growth factor receptor 1
Name:Vascular endothelial growth factor receptor 1
Type:Receptor Tyrosine Kinase
Mol. Mass.:150800.23
Organism:Homo sapiens (Human)
Description:P17948
Residue:1338
BDBM50349005
NameBDBM50349005
Synonyms:CHEMBL1807470
TypeSmall organic molecule
Emp. Form.C28H30N6O3S
Mol. Mass.530.641
SMILESCN1CCN(CC1)c1ccc(cc1)C(=O)Nc1cc(n[nH]1)-c1cccc(NS(=O)(=O)c2ccc(C)cc2)c1