Reaction Details
TargetVascular endothelial growth factor receptor 2
LigandBDBM50349019
Substrate/Competitorn/a
Meas. Tech.ChEMBL_758709 (CHEMBL1810161)
IC50 140±n/a nM
Citation Lin, WHHsieh, SYYen, SCChen, CTYeh, TKHsu, TLu, CTChen, CPChen, CWChou, LHHuang, YLCheng, AHChang, YITseng, YJYen, KRChao, YSHsu, JTJiaang, WT Discovery and evaluation of 3-phenyl-1H-5-pyrazolylamine-based derivatives as potent, selective and efficacious inhibitors of FMS-like tyrosine kinase-3 (FLT3). Bioorg Med Chem19:4173-82 (2011) 
 
Vascular endothelial growth factor receptor 2
Name:Vascular endothelial growth factor receptor 2
Type:Receptor Tyrosine Kinase
Mol. Mass.:151510.97
Organism:Homo sapiens (Human)
Description:P35968
Residue:1356
BDBM50349019
NameBDBM50349019
Synonyms:CHEMBL1807786
TypeSmall organic molecule
Emp. Form.C26H30N8O3S
Mol. Mass.534.633
SMILESCc1nc(Nc2cc(n[nH]2)-c2cccc(NS(=O)(=O)c3ccccc3)c2)cc(n1)N1CCN(CCO)CC1