Reaction Details
TargetReceptor-type tyrosine-protein kinase FLT3
LigandBDBM21079
Substrate/Competitorn/a
Meas. Tech.ChEMBL_758713 (CHEMBL1810165)
IC50 20±n/a nM
Citation Lin, WHHsieh, SYYen, SCChen, CTYeh, TKHsu, TLu, CTChen, CPChen, CWChou, LHHuang, YLCheng, AHChang, YITseng, YJYen, KRChao, YSHsu, JTJiaang, WT Discovery and evaluation of 3-phenyl-1H-5-pyrazolylamine-based derivatives as potent, selective and efficacious inhibitors of FMS-like tyrosine kinase-3 (FLT3). Bioorg Med Chem19:4173-82 (2011) 
 
Receptor-type tyrosine-protein kinase FLT3
Name:Receptor-type tyrosine-protein kinase FLT3
Type:Enzyme
Mol. Mass.:112888.62
Organism:Homo sapiens (Human)
Description:P36888
Residue:993
BDBM21079
NameBDBM21079
Synonyms:1-[4-(3-amino-1H-indazol-4-yl)phenyl]-3-(2-fluoro-5-methyl-phenyl)urea 1-[4-(3-azanyl-1H-indazol-4-yl)phenyl]-3-(2-fluoranyl-5-methyl-phenyl)urea ABT-869 CHEMBL223360 | cid_11485656
TypeSmall organic molecule
Emp. Form.C21H18FN5O
Mol. Mass.375.3989
SMILESCc1ccc(F)c(NC(=O)Nc2ccc(cc2)-c2cccc3[nH]nc(N)c23)c1