Reaction Details
TargetReceptor-type tyrosine-protein kinase FLT3
LigandBDBM50349026
Substrate/Competitorn/a
Meas. Tech.ChEMBL_758713 (CHEMBL1810165)
IC50>1000±n/a nM
Citation Lin, WHHsieh, SYYen, SCChen, CTYeh, TKHsu, TLu, CTChen, CPChen, CWChou, LHHuang, YLCheng, AHChang, YITseng, YJYen, KRChao, YSHsu, JTJiaang, WT Discovery and evaluation of 3-phenyl-1H-5-pyrazolylamine-based derivatives as potent, selective and efficacious inhibitors of FMS-like tyrosine kinase-3 (FLT3). Bioorg Med Chem19:4173-82 (2011) 
 
Receptor-type tyrosine-protein kinase FLT3
Name:Receptor-type tyrosine-protein kinase FLT3
Type:Enzyme
Mol. Mass.:112888.62
Organism:Homo sapiens (Human)
Description:P36888
Residue:993
BDBM50349026
NameBDBM50349026
Synonyms:CHEMBL1807389
TypeSmall organic molecule
Emp. Form.C23H17F3N4O3S
Mol. Mass.486.466
SMILESFC(F)(F)c1cccc(c1)C(=O)Nc1cc(n[nH]1)-c1cccc(NS(=O)(=O)c2ccccc2)c1