Reaction Details
TargetReceptor-type tyrosine-protein kinase FLT3
LigandBDBM50349006
Substrate/Competitorn/a
Meas. Tech.ChEMBL_758713 (CHEMBL1810165)
IC50 90±n/a nM
Citation Lin, WHHsieh, SYYen, SCChen, CTYeh, TKHsu, TLu, CTChen, CPChen, CWChou, LHHuang, YLCheng, AHChang, YITseng, YJYen, KRChao, YSHsu, JTJiaang, WT Discovery and evaluation of 3-phenyl-1H-5-pyrazolylamine-based derivatives as potent, selective and efficacious inhibitors of FMS-like tyrosine kinase-3 (FLT3). Bioorg Med Chem19:4173-82 (2011) 
 
Receptor-type tyrosine-protein kinase FLT3
Name:Receptor-type tyrosine-protein kinase FLT3
Type:Enzyme
Mol. Mass.:112888.62
Organism:Homo sapiens (Human)
Description:P36888
Residue:993
BDBM50349006
NameBDBM50349006
Synonyms:CHEMBL1807471
TypeSmall organic molecule
Emp. Form.C28H30N6O4S
Mol. Mass.546.641
SMILESCOc1ccc(cc1)S(=O)(=O)Nc1cccc(c1)-c1cc(NC(=O)c2ccc(cc2)N2CCN(C)CC2)[nH]n1