Reaction Details
TargetReceptor-type tyrosine-protein kinase FLT3
LigandBDBM50349023
Substrate/Competitorn/a
Meas. Tech.ChEMBL_758713 (CHEMBL1810165)
IC50 350±n/a nM
Citation Lin, WHHsieh, SYYen, SCChen, CTYeh, TKHsu, TLu, CTChen, CPChen, CWChou, LHHuang, YLCheng, AHChang, YITseng, YJYen, KRChao, YSHsu, JTJiaang, WT Discovery and evaluation of 3-phenyl-1H-5-pyrazolylamine-based derivatives as potent, selective and efficacious inhibitors of FMS-like tyrosine kinase-3 (FLT3). Bioorg Med Chem19:4173-82 (2011) 
 
Receptor-type tyrosine-protein kinase FLT3
Name:Receptor-type tyrosine-protein kinase FLT3
Type:Enzyme
Mol. Mass.:112888.62
Organism:Homo sapiens (Human)
Description:P36888
Residue:993
BDBM50349023
NameBDBM50349023
Synonyms:CHEMBL1807480
TypeSmall organic molecule
Emp. Form.C27H27N5O4S
Mol. Mass.517.599
SMILESO=C(Nc1cc(n[nH]1)-c1cccc(NS(=O)(=O)c2ccccc2)c1)c1ccc(CN2CCOCC2)cc1