Reaction Details
TargetReceptor-type tyrosine-protein kinase FLT3
LigandBDBM50349017
Substrate/Competitorn/a
Meas. Tech.ChEMBL_758713 (CHEMBL1810165)
IC50 110±n/a nM
Citation Lin, WHHsieh, SYYen, SCChen, CTYeh, TKHsu, TLu, CTChen, CPChen, CWChou, LHHuang, YLCheng, AHChang, YITseng, YJYen, KRChao, YSHsu, JTJiaang, WT Discovery and evaluation of 3-phenyl-1H-5-pyrazolylamine-based derivatives as potent, selective and efficacious inhibitors of FMS-like tyrosine kinase-3 (FLT3). Bioorg Med Chem19:4173-82 (2011) 
 
Receptor-type tyrosine-protein kinase FLT3
Name:Receptor-type tyrosine-protein kinase FLT3
Type:Enzyme
Mol. Mass.:112888.62
Organism:Homo sapiens (Human)
Description:P36888
Residue:993
BDBM50349017
NameBDBM50349017
Synonyms:CHEMBL1807485
TypeSmall organic molecule
Emp. Form.C23H32N8O2S
Mol. Mass.484.618
SMILESCCCCS(=O)(=O)Nc1cccc(c1)-c1cc(Nc2cc(nc(C)n2)N2CCN(C)CC2)[nH]n1