Reaction Details
TargetHeat shock protein HSP 90-alpha
LigandBDBM50349038
Substrate/Competitorn/a
Meas. Tech.ChEMBL_758910 (CHEMBL1810576)
IC50 58±n/a nM
Citation Zapf, CWBloom, JDLi, ZDushin, RGNittoli, TOtteng, MNikitenko, AGolas, JMLiu, HLucas, JBoschelli, FVogan, EOlland, AJohnson, MLevin, JI Discovery of a stable macrocyclic o-aminobenzamide Hsp90 inhibitor which significantly decreases tumor volume in a mouse xenograft model. Bioorg Med Chem Lett21:4602-7 (2011) 
 
Heat shock protein HSP 90-alpha
Name:Heat shock protein HSP 90-alpha
Type:Molecular Chaperone
Mol. Mass.:84623.45
Organism:Homo sapiens (Human)
Description:P07900
Residue:732
BDBM50349038
NameBDBM50349038
Synonyms:CHEMBL1807797
TypeSmall organic molecule
Emp. Form.C27H36N4O3
Mol. Mass.464.5997
SMILESC[C@@H]1CN(CCc2c(C)c3c(CC(C)(C)CC3=O)n2-c2ccc(C(N)=O)c(N[C@H]1C)c2)C(C)=O