Reaction Details
TargetPeptide deformylase
LigandBDBM50089194
Substrate/Competitorn/a
Meas. Tech.ChEMBL_759155 (CHEMBL1811212)
IC50 140±n/a nM
Citation Antczak, CShum, DBassit, BFrattini, MGLi, Yde Stanchina, EScheinberg, DADjaballah, H Identification of benzofuran-4,5-diones as novel and selective non-hydroxamic acid, non-peptidomimetic based inhibitors of human peptide deformylase. Bioorg Med Chem Lett21:4528-32 (2011) 
 
Peptide deformylase
Name:Peptide deformylase
Type:n/a
Mol. Mass.:16901.39
Organism:Escherichia coli
Description:n/a
Residue:150
BDBM50089194
NameBDBM50089194
Synonyms:(R)-N*4*-Hydroxy-N*1*-[(S)-1-((S)-2-hydroxymethyl-pyrrolidine-1-carbonyl)-2-methyl-propyl]-2-pentyl-succinamide ACTINONIN N*4*-Hydroxy-N*1*-[(S)-1-((S)-2-hydroxymethyl-pyrrolidine-1-carbonyl)-2-methyl-propyl]-2-(R)-pentyl-succinamide | N*4*-Hydroxy-N*1*-[1-(2-hydroxymethyl-pyrrolidine-1-carbonyl)-2-methyl-propyl]-2-pentyl-succinamide
TypeSmall organic molecule
Emp. Form.C19H35N3O5
Mol. Mass.385.4983
SMILESCCCCC[C@H](CC(=O)NO)C(=O)N[C@@H](C(C)C)C(=O)N1CCC[C@H]1CO