Reaction Details
TargetCarbonic anhydrase 1
LigandBDBM50349112
Substrate/Competitorn/a
Meas. Tech.ChEMBL_757844 (CHEMBL1809788)
Ki 75400±n/a nM
Citation Rodríguez, OMMaresca, ATémpera, CABravo, RDColinas, PASupuran, CT N-ß-glycosyl sulfamides are selective inhibitors of the cancer associated carbonic anhydrase isoforms IX and XII. Bioorg Med Chem Lett21:4447-50 (2011) 
 
Carbonic anhydrase 1
Name:Carbonic anhydrase 1
Type:Enzyme
Mol. Mass.:28873.37
Organism:Homo sapiens (Human)
Description:P00915
Residue:261
BDBM50349112
NameBDBM50349112
Synonyms:CHEMBL1807500
TypeSmall organic molecule
Emp. Form.C6H14N2O7S
Mol. Mass.258.25
SMILESNS(=O)(=O)N[C@@H]1O[C@H](CO)[C@@H](O)[C@H](O)[C@H]1O