Reaction Details
TargetCarbonic anhydrase 1
LigandBDBM50349115
Substrate/Competitorn/a
Meas. Tech.ChEMBL_757844 (CHEMBL1809788)
Ki 830±n/a nM
Citation Rodríguez, OMMaresca, ATémpera, CABravo, RDColinas, PASupuran, CT N-ß-glycosyl sulfamides are selective inhibitors of the cancer associated carbonic anhydrase isoforms IX and XII. Bioorg Med Chem Lett21:4447-50 (2011) 
 
Carbonic anhydrase 1
Name:Carbonic anhydrase 1
Type:Enzyme
Mol. Mass.:28873.37
Organism:Homo sapiens (Human)
Description:P00915
Residue:261
BDBM50349115
NameBDBM50349115
Synonyms:CHEMBL1807504
TypeSmall organic molecule
Emp. Form.C12H20N2O9S
Mol. Mass.368.36
SMILESCC(=O)OC[C@H]1O[C@H](C[C@@H](OC(C)=O)[C@@H]1OC(C)=O)NS(N)(=O)=O