Reaction Details
TargetCarbonic anhydrase 12
LigandBDBM50349110
Substrate/Competitorn/a
Meas. Tech.ChEMBL_757847 (CHEMBL1809791)
Ki 5.6±n/a nM
Citation Rodríguez, OMMaresca, ATémpera, CABravo, RDColinas, PASupuran, CT N-ß-glycosyl sulfamides are selective inhibitors of the cancer associated carbonic anhydrase isoforms IX and XII. Bioorg Med Chem Lett21:4447-50 (2011) 
 
Carbonic anhydrase 12
Name:Carbonic anhydrase 12
Type:Enzyme
Mol. Mass.:39456.00
Organism:Homo sapiens (Human)
Description:Catalytic domain of human cloned isozyme was used in the assay
Residue:354
BDBM50349110
NameBDBM50349110
Synonyms:CHEMBL1807498
TypeSmall organic molecule
Emp. Form.C14H22N2O11S
Mol. Mass.426.396
SMILESCC(=O)OC[C@H]1O[C@@H](NS(N)(=O)=O)[C@@H](OC(C)=O)[C@@H](OC(C)=O)[C@@H]1OC(C)=O