Reaction Details
Target5-hydroxytryptamine receptor 6
LigandBDBM34141
Substrate/Competitorn/a
Meas. Tech.ChEMBL_759558 (CHEMBL1811084)
Ki 2.1±n/a nM
Citation Nirogi, RDwarampudi, AKambhampati, RBhatta, VKota, LShinde, ABadange, RJayarajan, PBhyrapuneni, GDubey, PK Rigidized 1-aryl sulfonyl tryptamines: synthesis and pharmacological evaluation as 5-HT6 receptor ligands. Bioorg Med Chem Lett21:4577-80 (2011) 
 
5-hydroxytryptamine receptor 6
Name:5-hydroxytryptamine receptor 6
Type:G Protein-Coupled Receptor (GPCR)
Mol. Mass.:46968.43
Organism:Homo sapiens (Human)
Description:P50406
Residue:440
BDBM34141
NameBDBM34141
Synonyms:CHEMBL76237 | MS-245
TypeSmall organic molecule
Emp. Form.C19H22N2O3S
Mol. Mass.358.455
SMILESCOc1ccc2n(cc(CCN(C)C)c2c1)S(=O)(=O)c1ccccc1