Reaction Details
TargetChymase
LigandBDBM50349180
Substrate/Competitorn/a
Meas. Tech.ChEMBL_759674 (CHEMBL1811418)
IC50 600±n/a nM
Citation Lo, HYNemoto, PAKim, JMHao, MHQian, KCFarrow, NAAlbaugh, DRFowler, DMSchneiderman, RDMichael August, EMartin, LHill-Drzewi, MPullen, SSTakahashi, HDe Lombaert, S Benzimidazolone as potent chymase inhibitor: modulation of reactive metabolite formation in the hydrophobic (P1) region. Bioorg Med Chem Lett21:4533-9 (2011) 
 
Chymase
Name:Chymase
Type:Enzyme
Mol. Mass.:27340.12
Organism:Homo sapiens (Human)
Description:n/a
Residue:247
BDBM50349180
NameBDBM50349180
Synonyms:CHEMBL1807530
TypeSmall organic molecule
Emp. Form.C21H18N2O3
Mol. Mass.346.3792
SMILESOC(=O)CCn1c2ccccc2n(Cc2cccc3ccccc23)c1=O