Reaction Details
TargetChymase
LigandBDBM50349183
Substrate/Competitorn/a
Meas. Tech.ChEMBL_759674 (CHEMBL1811418)
IC50 640±n/a nM
Citation Lo, HYNemoto, PAKim, JMHao, MHQian, KCFarrow, NAAlbaugh, DRFowler, DMSchneiderman, RDMichael August, EMartin, LHill-Drzewi, MPullen, SSTakahashi, HDe Lombaert, S Benzimidazolone as potent chymase inhibitor: modulation of reactive metabolite formation in the hydrophobic (P1) region. Bioorg Med Chem Lett21:4533-9 (2011) 
 
Chymase
Name:Chymase
Type:Enzyme
Mol. Mass.:27340.12
Organism:Homo sapiens (Human)
Description:n/a
Residue:247
BDBM50349183
NameBDBM50349183
Synonyms:CHEMBL1807538
TypeSmall organic molecule
Emp. Form.C21H21N3O3
Mol. Mass.363.4097
SMILESCc1cn(C)c2c(Cn3c4ccccc4n(CCC(O)=O)c3=O)cccc12