Reaction Details
TargetCathepsin G
LigandBDBM50349177
Substrate/Competitorn/a
Meas. Tech.ChEMBL_759675 (CHEMBL1811508)
IC50>10±n/a nM
Citation Lo, HYNemoto, PAKim, JMHao, MHQian, KCFarrow, NAAlbaugh, DRFowler, DMSchneiderman, RDMichael August, EMartin, LHill-Drzewi, MPullen, SSTakahashi, HDe Lombaert, S Benzimidazolone as potent chymase inhibitor: modulation of reactive metabolite formation in the hydrophobic (P1) region. Bioorg Med Chem Lett21:4533-9 (2011) 
 
Cathepsin G
Name:Cathepsin G
Type:PROTEIN
Mol. Mass.:28860.08
Organism:Homo sapiens (Human)
Description:ChEMBL_1469016
Residue:255
BDBM50349177
NameBDBM50349177
Synonyms:CHEMBL1807639
TypeSmall organic molecule
Emp. Form.C23H25N3O4
Mol. Mass.407.4623
SMILESCOc1cc(Cn2c3ccccc3n(CCC(O)=O)c2=O)c2n(C)c(C)c(C)c2c1