Reaction Details
TargetCathepsin S
LigandBDBM50349197
Substrate/Competitorn/a
Meas. Tech.ChEMBL_759683 (CHEMBL1811516)
IC50 0.5±n/a nM
Citation Kerns, JKNie, HBondinell, WWiddowson, KLYamashita, DSRahman, APodolin, PLCarpenter, DCJin, QRiflade, BDong, XNevins, NKeller, PMMitchell, LTomaszek, T Azepanone-based inhibitors of human cathepsin S: optimization of selectivity via the P2 substituent. Bioorg Med Chem Lett21:4409-15 (2011) 
 
Cathepsin S
Name:Cathepsin S
Type:Protein
Mol. Mass.:37507.38
Organism:Homo sapiens (Human)
Description:P25774
Residue:331
BDBM50349197
NameBDBM50349197
Synonyms:CHEMBL1807647
TypeSmall organic molecule
Emp. Form.C26H34N4O6S
Mol. Mass.530.636
SMILESC[C@@H]1CC[C@H](NC(=O)[C@H](CC2CCCCC2)NC(=O)c2ccco2)C(=O)CN1S(=O)(=O)c1ccccn1