Reaction Details
TargetCathepsin S
LigandBDBM50349205
Substrate/Competitorn/a
Meas. Tech.ChEMBL_759683 (CHEMBL1811516)
IC50 0.58±n/a nM
Citation Kerns, JKNie, HBondinell, WWiddowson, KLYamashita, DSRahman, APodolin, PLCarpenter, DCJin, QRiflade, BDong, XNevins, NKeller, PMMitchell, LTomaszek, T Azepanone-based inhibitors of human cathepsin S: optimization of selectivity via the P2 substituent. Bioorg Med Chem Lett21:4409-15 (2011) 
 
Cathepsin S
Name:Cathepsin S
Type:Protein
Mol. Mass.:37507.38
Organism:Homo sapiens (Human)
Description:P25774
Residue:331
BDBM50349205
NameBDBM50349205
Synonyms:CHEMBL1807700
TypeSmall organic molecule
Emp. Form.C26H39N5O6S
Mol. Mass.549.683
SMILESC[C@@H]1CC[C@H](NC(=O)[C@H](CCC2CCCC2)NC(=O)N2CCOCC2)C(=O)CN1S(=O)(=O)c1ccccn1