Reaction Details
TargetCathepsin K
LigandBDBM50349210
Substrate/Competitorn/a
Meas. Tech.ChEMBL_759684 (CHEMBL1811517)
IC50 11.2±n/a nM
Citation Kerns, JKNie, HBondinell, WWiddowson, KLYamashita, DSRahman, APodolin, PLCarpenter, DCJin, QRiflade, BDong, XNevins, NKeller, PMMitchell, LTomaszek, T Azepanone-based inhibitors of human cathepsin S: optimization of selectivity via the P2 substituent. Bioorg Med Chem Lett21:4409-15 (2011) 
 
Cathepsin K
Name:Cathepsin K
Type:Enzyme
Mol. Mass.:36975.68
Organism:Homo sapiens (Human)
Description:P43235
Residue:329
BDBM50349210
NameBDBM50349210
Synonyms:CHEMBL1807651
TypeSmall organic molecule
Emp. Form.C26H34N4O6S
Mol. Mass.530.636
SMILESC[C@@H]1CC[C@H](NC(=O)[C@H](CC2(C)CCCC2)NC(=O)c2ccco2)C(=O)CN1S(=O)(=O)c1ccccn1