Reaction Details
TargetTGF-beta receptor type-1
LigandBDBM50349213
Substrate/Competitorn/a
Meas. Tech.ChEMBL_759693 (CHEMBL1811526)
IC50 10±n/a nM
Citation Stellwagen, JCAdjabeng, GMArnone, MRDickerson, SHHan, CHornberger, KRKing, AJMook, RAPetrov, KGRheault, TRRominger, CMRossanese, OWSmitheman, KNWaterson, AGUehling, DE Development of potent B-RafV600E inhibitors containing an arylsulfonamide headgroup. Bioorg Med Chem Lett21:4436-40 (2011) 
 
TGF-beta receptor type-1
Name:TGF-beta receptor type-1
Type:enzyme
Mol. Mass.:55968.24
Organism:Homo sapiens (Human)
Description:P36897
Residue:503
BDBM50349213
NameBDBM50349213
Synonyms:CHEMBL1808264 | D3RKN_42
TypeSmall organic molecule
Emp. Form.C31H28F3N7O3S2
Mol. Mass.667.724
SMILESCC(C)c1nc(c(s1)-c1ccnc(Nc2ccc(nc2)N2CCOCC2)n1)-c1ccc(F)c(NS(=O)(=O)c2c(F)cccc2F)c1