Reaction Details
TargetSmoothened homolog
LigandBDBM50349268
Substrate/Competitorn/a
Meas. Tech.ChEMBL_759897 (CHEMBL1810043)
IC50 13±n/a nM
Citation Malancona, SAltamura, SFilocamo, GKinzel, OHernando, JIRowley, MScarpelli, RSteinkühler, CJones, P Identification of MK-5710 ((8aS)-8a-methyl-1,3-dioxo-2-[(1S,2R)-2-phenylcyclopropyl]-N-(1-phenyl-1H-pyrazol-5-yl)hexahydroimid azo[1,5-a]pyrazine-7(1H)-carboxamide), a potent smoothened antagonist for use in Hedgehog pathway dependent malignancies, part 1. Bioorg Med Chem Lett21:4422-8 (2011) 
 
Smoothened homolog
Name:Smoothened homolog
Type:Protein
Mol. Mass.:86415.51
Organism:Homo sapiens (Human)
Description:Q99835
Residue:787
BDBM50349268
NameBDBM50349268
Synonyms:CHEMBL1807231 | CHEMBL1813109
TypeSmall organic molecule
Emp. Form.C25H24N6O3
Mol. Mass.456.4965
SMILESOc1c2CN(CCn2c(=O)n1[C@H]1C[C@@H]1c1ccccc1)C(=O)Nc1ccnn1-c1ccccc1