Reaction Details
Target3-oxoacyl-[acyl-carrier-protein] synthase 3
LigandBDBM50349319
Substrate/Competitorn/a
Meas. Tech.ChEMBL_760083 (CHEMBL1810406)
Ki 0.000609790±n/a nM
Citation Zhang, HJZhu, DDLi, ZLSun, JZhu, HL Synthesis, molecular modeling and biological evaluation ofß-ketoacyl-acyl carrier protein synthase III (FabH) as novel antibacterial agents. Bioorg Med Chem19:4513-9 (2011) 
 
3-oxoacyl-[acyl-carrier-protein] synthase 3
Name:3-oxoacyl-[acyl-carrier-protein] synthase 3
Type:Enzyme
Mol. Mass.:33506.68
Organism:Escherichia coli
Description:C3TDZ2
Residue:317
BDBM50349319
NameBDBM50349319
Synonyms:CHEMBL1807656
TypeSmall organic molecule
Emp. Form.C17H19N3O5
Mol. Mass.345.3499
SMILESCOc1ccc(\C=C\C(=O)OC(C)Cn2c(C)ncc2[N+]([O-])=O)cc1