Reaction Details
Target3-oxoacyl-[acyl-carrier-protein] synthase 3
LigandBDBM50349328
Substrate/Competitorn/a
Meas. Tech.ChEMBL_760083 (CHEMBL1810406)
Ki 0.00011120±n/a nM
Citation Zhang, HJZhu, DDLi, ZLSun, JZhu, HL Synthesis, molecular modeling and biological evaluation ofß-ketoacyl-acyl carrier protein synthase III (FabH) as novel antibacterial agents. Bioorg Med Chem19:4513-9 (2011) 
 
3-oxoacyl-[acyl-carrier-protein] synthase 3
Name:3-oxoacyl-[acyl-carrier-protein] synthase 3
Type:Enzyme
Mol. Mass.:33506.68
Organism:Escherichia coli
Description:C3TDZ2
Residue:317
BDBM50349328
NameBDBM50349328
Synonyms:CHEMBL1807659
TypeSmall organic molecule
Emp. Form.C18H22N4O4
Mol. Mass.358.3917
SMILESCC(Cn1c(C)ncc1[N+]([O-])=O)OC(=O)\C=C\c1ccc(cc1)N(C)C