Reaction Details
TargetTransmembrane protease serine 11D
LigandBDBM50349342
Substrate/Competitorn/a
Meas. Tech.ChEMBL_760105 (CHEMBL1810428)
Ki 210±n/a nM
Citation Sielaff, FBöttcher-Friebertshäuser, EMeyer, DSaupe, SMVolk, IMGarten, WSteinmetzer, T Development of substrate analogue inhibitors for the human airway trypsin-like protease HAT. Bioorg Med Chem Lett21:4860-4 (2011) 
 
Transmembrane protease serine 11D
Name:Transmembrane protease serine 11D
Type:PROTEIN
Mol. Mass.:46272.53
Organism:Homo sapiens (Human)
Description:ChEMBL_840134
Residue:418
BDBM50349342
NameBDBM50349342
Synonyms:CHEMBL1809248
TypeSmall organic molecule
Emp. Form.C30H41N7O6S
Mol. Mass.627.755
SMILESNC(=N)c1ccc(CNC(=O)[C@@H]2CCCN2C(=O)[C@@H](CC(=O)N2CCN(CCO)CC2)NS(=O)(=O)Cc2ccccc2)cc1