Reaction Details
TargetProthrombin
LigandBDBM50349334
Substrate/Competitorn/a
Meas. Tech.ChEMBL_760106 (CHEMBL1810429)
Ki 9.8±n/a nM
Citation Sielaff, FBöttcher-Friebertshäuser, EMeyer, DSaupe, SMVolk, IMGarten, WSteinmetzer, T Development of substrate analogue inhibitors for the human airway trypsin-like protease HAT. Bioorg Med Chem Lett21:4860-4 (2011) 
 
Prothrombin
Name:Prothrombin
Type:Protein
Mol. Mass.:70029.57
Organism:Homo sapiens (Human)
Description:P00734
Residue:622
BDBM50349334
NameBDBM50349334
Synonyms:CHEMBL1809239
TypeSmall organic molecule
Emp. Form.C37H45N7O7S
Mol. Mass.731.861
SMILESNC(=N)c1ccc(CNC(=O)[C@@H]2CCCN2C(=O)[C@@H](CCC(=O)N2CCN(CC2)C(=O)OCc2ccccc2)NS(=O)(=O)Cc2ccccc2)cc1