Reaction Details
TargetCoagulation factor X
LigandBDBM50349357
Substrate/Competitorn/a
Meas. Tech.ChEMBL_760107 (CHEMBL1810430)
Ki 31±n/a nM
Citation Sielaff, FBöttcher-Friebertshäuser, EMeyer, DSaupe, SMVolk, IMGarten, WSteinmetzer, T Development of substrate analogue inhibitors for the human airway trypsin-like protease HAT. Bioorg Med Chem Lett21:4860-4 (2011) 
 
Coagulation factor X
Name:Coagulation factor X
Type:Enzyme
Mol. Mass.:54726.60
Organism:Homo sapiens (Human)
Description:n/a
Residue:488
BDBM50349357
NameBDBM50349357
Synonyms:CHEMBL1809214
TypeSmall organic molecule
Emp. Form.C29H39N5O6S
Mol. Mass.585.715
SMILESCC(C)(C)OC(=O)CC[C@@H](NS(=O)(=O)Cc1ccccc1)C(=O)N1CCC[C@H]1C(=O)NCc1ccc(cc1)C(N)=N