Reaction Details
TargetPlasminogen
LigandBDBM50349355
Substrate/Competitorn/a
Meas. Tech.ChEMBL_760108 (CHEMBL1810431)
Ki 17.5±n/a nM
Citation Sielaff, FBöttcher-Friebertshäuser, EMeyer, DSaupe, SMVolk, IMGarten, WSteinmetzer, T Development of substrate analogue inhibitors for the human airway trypsin-like protease HAT. Bioorg Med Chem Lett21:4860-4 (2011) 
 
Plasminogen
Name:Plasminogen
Type:Enzyme
Mol. Mass.:90579.18
Organism:Homo sapiens (Human)
Description:n/a
Residue:810
BDBM50349355
NameBDBM50349355
Synonyms:CHEMBL1809213
TypeSmall organic molecule
Emp. Form.C27H38N8O4S
Mol. Mass.570.707
SMILES[#7]\[#6](-[#7])=[#7]\[#6]-[#6]-[#6]-[#6]-[#6@@H](-[#7]S(=O)(=O)[#6]-c1ccccc1)-[#6](=O)-[#7]-1-[#6]-[#6]-[#6]-[#6@H]-1-[#6](=O)-[#7]-[#6]-c1ccc(cc1)-[#6](-[#7])=[#7]