Reaction Details
TargetHistone deacetylase 1
LigandBDBM24624
Substrate/Competitorn/a
Meas. Tech.ChEMBL_759500 (CHEMBL1810941)
IC50 152±n/a nM
Citation Shultz, MFan, JChen, CCho, YSDavis, NBickford, SButeau, KCao, XHolmqvist, MHsu, MJiang, LLiu, GLu, QPatel, CSuresh, JRSelvaraj, MUrban, LWang, PYan-Neale, YWhitehead, LZhang, HZhou, LAtadja, P The design, synthesis and structure-activity relationships of novel isoindoline-based histone deacetylase inhibitors. Bioorg Med Chem Lett21:4909-12 (2011) 
 
Histone deacetylase 1
Name:Histone deacetylase 1
Type:Enzyme
Mol. Mass.:55090.27
Organism:Homo sapiens (Human)
Description:Q13547
Residue:482
BDBM24624
NameBDBM24624
Synonyms:CHEMBL272980 MGCD0103 US10227295, Compound MGCD0103 US9409858, MGCD0103 US9956192, Compound MGCD0103
TypeSmall organic molecule
Emp. Form.C23H20N6O
Mol. Mass.396.4445
SMILESNc1ccccc1NC(=O)c1ccc(CNc2nccc(n2)-c2cccnc2)cc1