Reaction Details
TargetHistone deacetylase 1
LigandBDBM19428
Substrate/Competitorn/a
Meas. Tech.ChEMBL_759500 (CHEMBL1810941)
IC50 15±n/a nM
Citation Shultz, MFan, JChen, CCho, YSDavis, NBickford, SButeau, KCao, XHolmqvist, MHsu, MJiang, LLiu, GLu, QPatel, CSuresh, JRSelvaraj, MUrban, LWang, PYan-Neale, YWhitehead, LZhang, HZhou, LAtadja, P The design, synthesis and structure-activity relationships of novel isoindoline-based histone deacetylase inhibitors. Bioorg Med Chem Lett21:4909-12 (2011) 
 
Histone deacetylase 1
Name:Histone deacetylase 1
Type:Enzyme
Mol. Mass.:55090.27
Organism:Homo sapiens (Human)
Description:Q13547
Residue:482
BDBM19428
NameBDBM19428
Synonyms:(2E)-N-hydroxy-3-(4-{[(2-hydroxyethyl)[2-(1H-indol-3-yl)ethyl]amino]methyl}phenyl)prop-2-enamide CHEMBL356066 LAQ-824 | NVP-LAQ824
TypeSmall organic molecule
Emp. Form.C22H25N3O3
Mol. Mass.379.4522
SMILESOCCN(CCc1c[nH]c2ccccc12)Cc1ccc(\C=C\C(=O)NO)cc1