Reaction Details
Target3-oxoacyl-[acyl-carrier-protein] synthase 3
LigandBDBM50349529
Substrate/Competitorn/a
Meas. Tech.ChEMBL_759879 (CHEMBL1810025)
Ki 0.000008±n/a nM
Citation Li, ZLLi, QSZhang, HJHu, YZhu, DDZhu, HL Design, synthesis and biological evaluation of urea derivatives from o-hydroxybenzylamines and phenylisocyanate as potential FabH inhibitors. Bioorg Med Chem19:4413-20 (2011) 
 
3-oxoacyl-[acyl-carrier-protein] synthase 3
Name:3-oxoacyl-[acyl-carrier-protein] synthase 3
Type:Enzyme
Mol. Mass.:33506.68
Organism:Escherichia coli
Description:C3TDZ2
Residue:317
BDBM50349529
NameBDBM50349529
Synonyms:CHEMBL1808854
TypeSmall organic molecule
Emp. Form.C20H15Br2FN2O2
Mol. Mass.494.152
SMILESOc1c(Br)cc(Br)cc1CN(C(=O)Nc1ccccc1)c1ccccc1F