Reaction Details
TargetMetabotropic glutamate receptor 5
LigandBDBM50349554
Substrate/Competitorn/a
Meas. Tech.ChEMBL_759908 (CHEMBL1810054)
IC50 2000±n/a nM
Citation Weiss, JMJimenez, HNLi, GApril, MUberti, MABacolod, MDBrodbeck, RMDoller, D 6-Aryl-3-pyrrolidinylpyridines as mGlu5 receptor negative allosteric modulators. Bioorg Med Chem Lett21:4891-9 (2011) 
 
Metabotropic glutamate receptor 5
Name:Metabotropic glutamate receptor 5
Type:Enzyme
Mol. Mass.:132484.72
Organism:Homo sapiens (Human)
Description:n/a
Residue:1212
BDBM50349554
NameBDBM50349554
Synonyms:CHEMBL1808891
TypeSmall organic molecule
Emp. Form.C21H18F2N4O
Mol. Mass.380.3906
SMILESCc1cc(ncc1C1CCCN1C(=O)c1cnccn1)-c1cc(F)cc(F)c1