Reaction Details
TargetMetabotropic glutamate receptor 5
LigandBDBM50349558
Substrate/Competitorn/a
Meas. Tech.ChEMBL_759908 (CHEMBL1810054)
IC50 2400±n/a nM
Citation Weiss, JMJimenez, HNLi, GApril, MUberti, MABacolod, MDBrodbeck, RMDoller, D 6-Aryl-3-pyrrolidinylpyridines as mGlu5 receptor negative allosteric modulators. Bioorg Med Chem Lett21:4891-9 (2011) 
 
Metabotropic glutamate receptor 5
Name:Metabotropic glutamate receptor 5
Type:Enzyme
Mol. Mass.:132484.72
Organism:Homo sapiens (Human)
Description:n/a
Residue:1212
BDBM50349558
NameBDBM50349558
Synonyms:CHEMBL1808887
TypeSmall organic molecule
Emp. Form.C23H24ClN3O2S
Mol. Mass.441.974
SMILESCC(C)(O)Cc1cc(ncc1C1CCCN1C(=O)c1nccs1)-c1cccc(Cl)c1