Reaction Details
TargetMetabotropic glutamate receptor 5
LigandBDBM50349562
Substrate/Competitorn/a
Meas. Tech.ChEMBL_759909 (CHEMBL1810055)
Ki 7000±n/a nM
Citation Weiss, JMJimenez, HNLi, GApril, MUberti, MABacolod, MDBrodbeck, RMDoller, D 6-Aryl-3-pyrrolidinylpyridines as mGlu5 receptor negative allosteric modulators. Bioorg Med Chem Lett21:4891-9 (2011) 
 
Metabotropic glutamate receptor 5
Name:Metabotropic glutamate receptor 5
Type:Enzyme
Mol. Mass.:132484.72
Organism:Homo sapiens (Human)
Description:n/a
Residue:1212
BDBM50349562
NameBDBM50349562
Synonyms:CHEMBL1808882
TypeSmall organic molecule
Emp. Form.C21H23ClN2O3S
Mol. Mass.418.937
SMILESCc1cc(ncc1C1CCCN1C(=O)C1CCS(=O)(=O)C1)-c1cccc(Cl)c1