Reaction Details
TargetMetabotropic glutamate receptor 5
LigandBDBM50349564
Substrate/Competitorn/a
Meas. Tech.ChEMBL_759909 (CHEMBL1810055)
Ki 180±n/a nM
Citation Weiss, JMJimenez, HNLi, GApril, MUberti, MABacolod, MDBrodbeck, RMDoller, D 6-Aryl-3-pyrrolidinylpyridines as mGlu5 receptor negative allosteric modulators. Bioorg Med Chem Lett21:4891-9 (2011) 
 
Metabotropic glutamate receptor 5
Name:Metabotropic glutamate receptor 5
Type:Enzyme
Mol. Mass.:132484.72
Organism:Homo sapiens (Human)
Description:n/a
Residue:1212
BDBM50349564
NameBDBM50349564
Synonyms:CHEMBL1808880
TypeSmall organic molecule
Emp. Form.C22H20ClN3O
Mol. Mass.377.867
SMILESCc1cc(ncc1C1CCCN1C(=O)c1ccncc1)-c1cccc(Cl)c1