Reaction Details
TargetPhosphatidylinositol 4,5-bisphosphate 3-kinase catalytic subunit alpha isoform
LigandBDBM50349622
Substrate/Competitorn/a
Meas. Tech.ChEMBL_759993 (CHEMBL1810228)
IC50 0.6±n/a nM
Citation Dehnhardt, CMVenkatesan, AMChen, ZDelos-Santos, EAyral-Kaloustian, SBrooijmans, NYu, KHollander, IFeldberg, LLucas, JMallon, R Identification of 2-oxatriazines as highly potent pan-PI3K/mTOR dual inhibitors. Bioorg Med Chem Lett21:4773-8 (2011) 
 
Phosphatidylinositol 4,5-bisphosphate 3-kinase catalytic subunit alpha isoform
Name:Phosphatidylinositol 4,5-bisphosphate 3-kinase catalytic subunit alpha isoform
Type:Enzyme Subunit
Mol. Mass.:124294.87
Organism:Homo sapiens (Human)
Description:P42336
Residue:1068
BDBM50349622
NameBDBM50349622
Synonyms:CHEMBL1808980
TypeSmall organic molecule
Emp. Form.C26H32N8O4
Mol. Mass.520.5835
SMILESCOc1nc(nc(n1)-c1ccc(NC(=O)Nc2ccc(cc2)C(=O)NCCN(C)C)cc1)N1CCOCC1