Reaction Details
TargetSerine/threonine-protein kinase mTOR
LigandBDBM50308135
Substrate/Competitorn/a
Meas. Tech.ChEMBL_760021 (CHEMBL1810297)
IC50 0.4±n/a nM
Citation Dehnhardt, CMVenkatesan, AMChen, ZDelos-Santos, EAyral-Kaloustian, SBrooijmans, NYu, KHollander, IFeldberg, LLucas, JMallon, R Identification of 2-oxatriazines as highly potent pan-PI3K/mTOR dual inhibitors. Bioorg Med Chem Lett21:4773-8 (2011) 
 
Serine/threonine-protein kinase mTOR
Name:Serine/threonine-protein kinase mTOR
Type:Rapamycin target protein
Mol. Mass.:288917.12
Organism:Homo sapiens (Human)
Description:P42345
Residue:2549
BDBM50308135
NameBDBM50308135
Synonyms:1-(4-{[4-(Dimethylamino)piperidin-1-yl]carbonyl}phenyl)-3-[4-(4,6-dimorpholin-4-yl-1,3,5-triazin-2-yl)phenyl]urea PKI-587
TypeSmall organic molecule
Emp. Form.C32H41N9O4
Mol. Mass.615.7258
SMILESCN(C)C1CCN(CC1)C(=O)c1ccc(NC(=O)Nc2ccc(cc2)-c2nc(nc(n2)N2CCOCC2)N2CCOCC2)cc1