Reaction Details
TargetSerine/threonine-protein kinase mTOR
LigandBDBM50349629
Substrate/Competitorn/a
Meas. Tech.ChEMBL_760021 (CHEMBL1810297)
IC50 0.4±n/a nM
Citation Dehnhardt, CMVenkatesan, AMChen, ZDelos-Santos, EAyral-Kaloustian, SBrooijmans, NYu, KHollander, IFeldberg, LLucas, JMallon, R Identification of 2-oxatriazines as highly potent pan-PI3K/mTOR dual inhibitors. Bioorg Med Chem Lett21:4773-8 (2011) 
 
Serine/threonine-protein kinase mTOR
Name:Serine/threonine-protein kinase mTOR
Type:Rapamycin target protein
Mol. Mass.:288917.12
Organism:Homo sapiens (Human)
Description:P42345
Residue:2549
BDBM50349629
NameBDBM50349629
Synonyms:CHEMBL1808987
TypeSmall organic molecule
Emp. Form.C28H36N8O4
Mol. Mass.548.6366
SMILESCC(C)Oc1nc(nc(n1)-c1ccc(NC(=O)Nc2ccc(cc2)C(=O)NCCN(C)C)cc1)N1CCOCC1