Reaction Details
TargetSerine/threonine-protein kinase mTOR
LigandBDBM50349632
Substrate/Competitorn/a
Meas. Tech.ChEMBL_760021 (CHEMBL1810297)
IC50 0.3±n/a nM
Citation Dehnhardt, CMVenkatesan, AMChen, ZDelos-Santos, EAyral-Kaloustian, SBrooijmans, NYu, KHollander, IFeldberg, LLucas, JMallon, R Identification of 2-oxatriazines as highly potent pan-PI3K/mTOR dual inhibitors. Bioorg Med Chem Lett21:4773-8 (2011) 
 
Serine/threonine-protein kinase mTOR
Name:Serine/threonine-protein kinase mTOR
Type:Rapamycin target protein
Mol. Mass.:288917.12
Organism:Homo sapiens (Human)
Description:P42345
Residue:2549
BDBM50349632
NameBDBM50349632
Synonyms:CHEMBL1808990
TypeSmall organic molecule
Emp. Form.C31H38N8O5
Mol. Mass.602.684
SMILESO=C(Nc1ccc(cc1)C(=O)NCCN1CCCC1)Nc1ccc(cc1)-c1nc(O[C@H]2CCOC2)nc(n1)N1CCOCC1