Reaction Details
TargetC-X-C chemokine receptor type 3
LigandBDBM50349674
Substrate/Competitorn/a
Meas. Tech.ChEMBL_760041 (CHEMBL1810317)
IC50 14±n/a nM
Citation Thoma, GBaenteli, RLewis, IJones, DKovarik, JStreiff, MBZerwes, HG Special ergolines efficiently inhibit the chemokine receptor CXCR3 in blood. Bioorg Med Chem Lett21:4745-9 (2011) 
 
C-X-C chemokine receptor type 3
Name:C-X-C chemokine receptor type 3
Type:PROTEIN
Mol. Mass.:40937.37
Organism:Rattus norvegicus
Description:ChEMBL_760041
Residue:367
BDBM50349674
NameBDBM50349674
Synonyms:CHEMBL1809040
TypeSmall organic molecule
Emp. Form.C32H37N5O2
Mol. Mass.523.6685
SMILESO=C(Nc1ccccc1)N1C[C@@H](C=C2[C@H]1Cc1cn(CCN3CCCC3)c3cccc2c13)C(=O)N1CCCC1