Reaction Details
TargetKetohexokinase
LigandBDBM50349741
Substrate/Competitorn/a
Meas. Tech.ChEMBL_759463 (CHEMBL1810789)
IC50 23±n/a nM
Citation Zhang, XSong, FKuo, GHXiang, AGibbs, ACAbad, MCSun, WKuo, LCSui, Z Optimization of a pyrazole hit from FBDD into a novel series of indazoles as ketohexokinase inhibitors. Bioorg Med Chem Lett21:4762-7 (2011) 
 
Ketohexokinase
Name:Ketohexokinase
Type:Enzyme Catalytic Domain
Mol. Mass.:32521.64
Organism:Homo sapiens (Human)
Description:n/a
Residue:298
BDBM50349741
NameBDBM50349741
Synonyms:CHEMBL1809168 US9771375, Example 139
TypeSmall organic molecule
Emp. Form.C19H18FN3S
Mol. Mass.339.43
SMILESCSc1nn(-c2ccc(F)cc2)c2cc(ccc12)C1=CCNCC1