Reaction Details
TargetCytochrome P450 2D6
LigandBDBM50315200
Substrate/Competitorn/a
Meas. Tech.ChEMBL_760859 (CHEMBL1815844)
IC50 22000±n/a nM
Citation Moree, WJLi, BFZamani-Kord, SYu, JCoon, THuang, CMarinkovic, DTucci, FCMalany, SBradbury, MJHernandez, LMWen, JWang, HHoare, SRPetroski, REJalali, KYang, CSacaan, AMadan, ACrowe, PDBeaton, G Identification of a novel selective H1-antihistamine with optimized pharmacokinetic properties for clinical evaluation in the treatment of insomnia. Bioorg Med Chem Lett20:5874-8 (2010) 
 
Cytochrome P450 2D6
Name:Cytochrome P450 2D6
Type:Protein
Mol. Mass.:55774.82
Organism:Homo sapiens (Human)
Description:P10635
Residue:497
BDBM50315200
NameBDBM50315200
Synonyms:2-(6-fluoro-3-(pyridazin-3-ylmethyl)-1H-inden-2-yl)-N,N-dimethylethanamine | CHEMBL1092662
TypeSmall organic molecule
Emp. Form.C18H20FN3
Mol. Mass.297.3699
SMILESCN(C)CCC1=C(Cc2cccnn2)c2ccc(F)cc2C1